{"text_format":"1","workbook":"xlsx","n_sheets":3,"sheets":["はじめに読んでください","時間割一覧","stepＣ履修希望科目（様式②）"],"not_rendered":{"charts":0,"images":2,"macros":1,"external_links":0,"defined_names":2,"comments":0,"pivot_tables":0},"unopened":[],"bounds":{"document_bytes":16777216,"sheet_cells":100000,"rows_first":2000,"rows_last":500,"rows_between":2000,"halvings":0,"cell_chars":16384,"cell_head_chars":4096},"cells_cut":0,"cells_raw":0,"read":"whole","date_system":"1900"}

{"sheet":"はじめに読んでください","index":0,"n_rows":96,"n_cols":14,"rows_kept":96,"cut":false,"hidden":false,"merged":[[81,7,82,10],[85,2,86,2],[85,3,85,6],[85,7,86,10],[86,3,86,4],[86,5,86,6],[81,2,82,2],[81,3,81,6],[82,3,82,4],[82,5,82,6],[76,7,76,10],[77,3,77,4],[77,5,77,6],[77,7,77,8],[77,9,77,10],[76,2,77,2],[76,3,76,6],[67,2,68,2],[67,3,67,6],[67,7,67,10],[68,3,68,4],[68,5,68,6],[68,7,68,8],[68,9,68,10],[72,2,73,2],[72,3,72,6],[72,7,72,10],[73,3,73,4],[73,5,73,6],[73,7,73,8],[73,9,73,10]]}
["様式②  2020年度 スポーツ科学研究科  聴講可能科目および時間割　                    "]
[]
["（はじめに１）本Excelファイルを開いた際に「保護ビュー」と表示が出た場合は「編集を有効にする」を押してください。"]
[]
[]
[]
[]
[]
[]
["（はじめに２）本Excelファイルを開いた際に「セキュリティの警告」と表示が出た場合は「コンテンツの有効化」を押してください。"]
[]
[]
[]
[]
[]
[]
[]
[]
[]
["（時間割について）"]
[null,"・公開後に修正等が生じた場合は、適宜赤字で更新いたします。 "]
[null,"・未定部分については決まり次第、赤字で更新いたします。 "]
[null,"・時間割や本ファイルがうまく表示されない等、本件に関するお問い合わせは以下までお願いいたします。  "]
[null,"　 所沢総合事務センター資格担当（kyousyoku-tokorozawa@list.waseda.jp）"]
[]
[]
["●様式②作成にあたって、以下のとおりstepを踏んでください●"]
[null,"stepＡ：別sheet「時間割一覧」の（本人記入欄）に本人氏名・電話番号を入力してください"]
[null,"stepＢ：別sheet「時間割一覧」から履修希望科目を選択し、対象科目に☑を入れてください"]
[null,"　※時間割は学期・曜日・時限順となっています"]
[null,"stepＣ：☑を入れた科目が別sheet「stepC履修希望科目（様式②）」に反映されるため確認してください"]
[null,"　※履修上限単位数：年間8単位までとなります。"]
[null,"　※時間割の重複がないか、十分に注意してください"]
[null,"　　例.「春学期」科目と「春クォーター」科目の曜日・時限の重複の場合は、授業が同じ時間帯で行わわれるため履修できません"]
[null,"　※遠距離エラーがないか、十分に注意してください"]
[null,"　　例.2時限に所沢キャンパス、3時限に東伏見キャンパスの科目を申請した場合は、キャンパス間移動に必要な時間を空けていないため履修できません"]
[null,"　※（外国籍の方のみ）在留資格に必要な授業時間数を満たしているか十分に確認してください"]
[null,"　　⇒詳細について、下段（本Sheet2ページ目）の「■【重要】在留資格に関する注意事項」をご確認ください"]
[null,"stepＤ：選択・希望した科目に誤りがないか確認のうえ、A4サイズの用紙印刷し、その他の出願書類とともに所定の期間内に送付してください"]
[null,"　※希望した科目分の「聴講理由書（様式③）」の提出が必要となりますが、「様式②」と「様式③」の整理番号を対応させてください"]
[null,"「聴講理由書（様式③）」は出願書類一式から印刷してください。"]
[null,"　※（委託履修生のみ）研究指導科目は時間割に掲載されていないため、「研究指導（委託履修生のみ)」欄に希望科目を記入してください"]
[null,"stepＥ：別sheet「時間割一覧」にて科目数に応じた聴講料を確認してください"]
[null,"【聴講料について（入試要項より抜粋）】"]
[null,"・聴講料：1科目につき、56,300円（別途、演習科目を履修する場合には学期ごとに35,000円必要となります）"]
[null,"※科目によっては担当教員によって聴講を不可とする場合があります。この場合には聴講料の金額も変更となります。対象の方には個別にお知らせいたします"]
[]
[null,"本ファイルは入学まで各自保管してください。"]
[]
[null,null,null,null,null,null,null,null,null,null,null,null,null,"以　上"]
[]
[]
[]
[null,"（以下、2020年度4月入学科目等履修生募集要項より抜粋）"]
[null,"■【重要】在留資格に関する注意事項　【外国人留学生の方は必ず確認してください】"]
[]
[null,"・外国人留学生は、在留資格上の制約により、科目等履修生として在籍できる期間は（本学・他大学合わせて）通算1年間のみです。"]
[null,"　そのため、他大学で科目等履修生として在籍した場合、次年度に当学の科目等履修生となることを希望しても、入国管理局による在留資格の変更・更新は非常に困難です。"]
[]
[null,"・外国人留学生の方が科目等履修生で在留資格「留学」を取得するためには、在籍期間を通じて1週間に10時間以上の科目履修（※）が必要となります。"]
{"$rows_left_out":37}
{"sheet":"時間割一覧","index":1,"n_rows":308,"n_cols":22,"rows_kept":308,"cut":false,"hidden":false,"merged":[[2,14,2,17],[3,14,3,17],[2,20,2,21],[3,20,3,21],[1,14,1,17],[1,20,1,21]]}
["2020年度 スポーツ科学研究科  聴講可能科目および時間割　                    "]
[null,null,null,null,null,null,null,null,null,null,"最新更新日：2020/1/31",null,"stepＡ","（本人記入欄） ","※以下に記入した赤字の内容が「stepＣ履修希望科目（様式②）」に反映されます",null,null,null,null,"（本人記入欄）","※以下に記入した赤字の内容が「stepＣ履修希望科目（様式②）」に反映されます"]
[null,null,null,null,null,null,null,null,null,null,"情報公開日：2020/1/31",null,"★記入→","漢字氏名：","早稲田　太郎",null,null,null,null,"携帯電話：","090-9999-9999"]
[null,null,null,null,null,null,null,null,null,null,null,null,null,"カナ氏名：","ワセダ　タロウ",null,null,null,null,"自宅電話：","03-9999-9999"]
[]
[null,null,null,null,null,null,null,null,null,null,null,null,"stepＥ","（以下、自動計算となり記入不要です　※科目選択後に計算されます）",null,null,null,null,null,"（記入不要・自動計算）"]
[null,null,null,null,null,null,null,null,null,null,null,null,"★確認→","聴講料",null,"春学期聴講料：",{"$f":"SUM(E19:E160)","v":0},"円",null,"春学期科目数合計：",null,{"$f":"COUNTIF(C19:C160,-1)","v":0}]
[null,null,null,null,null,null,null,null,null,null,null,null,null,null,null,"実験演習料：",{"$f":"MAX(F19:F160)","v":0},"円"]
[null,null,null,null,null,null,null,null,null,null,null,null,null,null,null,"春学期合計：",{"$f":"SUM(Q7:Q8)","v":0},"円"]
[]
[null,null,null,null,null,null,null,null,null,null,null,null,null,null,"（記入不要・自動計算）",null,null,null,null,"（記入不要・自動計算）"]
[null,null,null,null,null,null,null,null,null,null,null,null,null,null,null,"秋学期聴講料：",{"$f":"SUM(E165:E307)","v":0},"円",null,"秋学期科目数合計：",null,{"$f":"COUNTIF(C165:C307,-1)","v":0}]
[null,null,null,null,null,null,null,null,null,null,null,null,null,null,null,"実験演習料：",{"$f":"MAX(F165:F307)","v":0},"円"]
[null,null,null,null,null,null,null,null,null,null,null,null,null,null,null,"秋学期合計：",{"$f":"SUM(Q12:Q13)","v":0},"円"]
[]
[]
["stepＢ","以下、希望する科目に☑を入れてください"]
["【春学期】\n","↓","【非表示】","【固定】\n関数IF","【固定】\n×単位数","【予め入力】\n演習サイン","【別sheetへ】選択科目","【非表示】学籍キー","【非表示】\n氏名",null,"整理番号","科目名","キャンパス","実施科目キー","科目クラスコード","学期","曜日","時限","単位数","担当教員","授業内容区分名称","備考"]
[null,null,0,{"$f":"IF(C19,56300,\"0\")","v":"0"},{"$f":"D19*S19","v":0},{"$f":"IF(AND(C19=-1,U19=\"専門演習\"),35000,\"0\")","v":"0"},{"$f":"IF(L19=\"\",\"\",IF(D19=56300,COUNTIF(D$19:D19,D19),\"\"))","v":""},null,null,null,1,"スポーツメディア論演習（１）Ａ","東伏見","5001013015","01","春学期","月","１時限",2,"トンプソン　リー　Ａ．","専門演習"]
[null,null,0,{"$f":"IF(C20,56300,\"0\")","v":"0"},0,{"$f":"IF(AND(C20=-1,U20=\"専門演習\"),35000,\"0\")","v":"0"},{"$f":"IF(L20=\"\",\"\",IF(D20=56300,COUNTIF(D$19:D20,D20),\"\"))","v":""},null,null,null,2,"アスレティックトレーニング演習（１）Ａ","東伏見","5001013238","01","春学期","月","１時限",2,"広瀬　統一","専門演習"]
[null,null,0,"0",0,"0",{"$f":"IF(L21=\"\",\"\",IF(D21=56300,COUNTIF(D$19:D21,D21),\"\"))","v":""},null,null,null,3,"筋生物学演習（１）Ａ","所沢","5001013240","01","春学期","月","１時限",2,"秋本　崇之","専門演習"]
[null,null,0,{"$f":"IF(C22,56300,\"0\")","v":"0"},{"$f":"D22*S22","v":0},{"$f":"IF(AND(C22=-1,U22=\"専門演習\"),35000,\"0\")","v":"0"},{"$f":"IF(L22=\"\",\"\",IF(D22=56300,COUNTIF(D$19:D22,D22),\"\"))","v":""},null,null,null,4,"冬季スポーツコーチング学演習（１）A","所沢",5001013440,"01","春学期","月","１時限",2,"藤田　善也","専門演習"]
[null,null,0,"0",0,"0",{"$f":"IF(L23=\"\",\"\",IF(D23=56300,COUNTIF(D$19:D23,D23),\"\"))","v":""},null,null,null,5,"舞踊表現特論","所沢","5001015024","01","春学期","月","２時限",2,"杉山　千鶴","専門講義"]
[null,null,0,"0",0,"0",{"$f":"IF(L24=\"\",\"\",IF(D24=56300,COUNTIF(D$19:D24,D24),\"\"))","v":""},null,null,null,6,"予防医学演習（１）Ａ","所沢","5001013236","01","春学期","月","２時限",2,"鈴木　克彦","専門演習"]
[null,null,0,"0",0,"0",{"$f":"IF(L25=\"\",\"\",IF(D25=56300,COUNTIF(D$19:D25,D25),\"\"))","v":""},null,null,null,7,"アスレティックトレーニング演習（２）Ａ","東伏見","5001014238","01","春学期","月","２時限",2,"広瀬　統一","専門演習"]
[null,null,0,{"$f":"IF(C26,56300,\"0\")","v":"0"},{"$f":"D26*S26","v":0},"0",{"$f":"IF(L26=\"\",\"\",IF(D26=56300,COUNTIF(D$19:D26,D26),\"\"))","v":""},null,null,null,8,"筋生物学演習（２）Ａ","所沢","5001014240","01","春学期","月","２時限",2,"秋本　崇之","専門演習"]
[null,null,0,{"$f":"IF(C27,56300,\"0\")","v":"0"},{"$f":"D27*S27","v":0},{"$f":"IF(AND(C27=-1,U27=\"専門演習\"),35000,\"0\")","v":"0"},{"$f":"IF(L27=\"\",\"\",IF(D27=56300,COUNTIF(D$19:D27,D27),\"\"))","v":""},null,null,null,9,"冬季スポーツコーチング学演習（２）A","所沢",5001014440,"01","春学期","月","２時限",2,"藤田　善也","専門演習"]
[null,null,0,"0",0,"0",{"$f":"IF(L28=\"\",\"\",IF(D28=56300,COUNTIF(D$19:D28,D28),\"\"))","v":""},null,null,null,10,"スポーツ社会学演習（１）Ａ","東伏見","5001013020","01","春学期","月","３時限",2,"中澤　篤史","専門演習"]
[null,null,0,"0",0,"0",{"$f":"IF(L29=\"\",\"\",IF(D29=56300,COUNTIF(D$19:D29,D29),\"\"))","v":""},null,null,null,11,"スポーツビジネス・アドミニストレーション演習（１）Ａ","東伏見","5001013124","01","春学期","月","３時限",2,"武藤　泰明","専門演習"]
[null,null,0,"0",0,"0",{"$f":"IF(L30=\"\",\"\",IF(D30=56300,COUNTIF(D$19:D30,D30),\"\"))","v":""},null,null,null,12,"スポーツビジネス法演習（１）Ａ","東伏見","5001013128","01","春学期","月","３時限",2,"松本　泰介","専門演習"]
[null,null,0,"0",0,"0",{"$f":"IF(L31=\"\",\"\",IF(D31=56300,COUNTIF(D$19:D31,D31),\"\"))","v":""},null,null,null,13,"健康行動科学演習（１）Ａ","所沢","5001013232","01","春学期","月","３時限",2,"岡　浩一朗","専門演習"]
[null,null,0,"0",0,"0",{"$f":"IF(L32=\"\",\"\",IF(D32=56300,COUNTIF(D$19:D32,D32),\"\"))","v":""},null,null,null,14,"健康教育学演習（１）Ａ","所沢","5001013246","01","春学期","月","３時限",2,"石井　香織","専門演習"]
[null,null,0,"0",0,"0",{"$f":"IF(L33=\"\",\"\",IF(D33=56300,COUNTIF(D$19:D33,D33),\"\"))","v":""},null,null,null,15,"アスレティックパフォーマンス演習（１）Ａ","所沢","5001013250","01","春学期","月","３時限",2,"平山　邦明","専門演習"]
[null,null,0,"0",0,"0",{"$f":"IF(L34=\"\",\"\",IF(D34=56300,COUNTIF(D$19:D34,D34),\"\"))","v":""},null,null,null,16,"運動器スポーツ機能解剖学特論","所沢","5001015256","01","春学期","月","３時限",2,"熊井　司","専門講義"]
[null,null,0,"0",0,"0",{"$f":"IF(L35=\"\",\"\",IF(D35=56300,COUNTIF(D$19:D35,D35),\"\"))","v":""},null,null,null,17,"チームスポーツコーチング特論","所沢","5001015430","01","春学期","月","３時限",2,"松井　泰二","専門講義"]
[null,null,0,"0",0,"0",{"$f":"IF(L36=\"\",\"\",IF(D36=56300,COUNTIF(D$19:D36,D36),\"\"))","v":""},null,null,null,18,"舞踊論演習（１）Ａ","所沢","5001013030","01","春学期","月","４時限",2,"杉山　千鶴","専門演習"]
[null,null,0,"0",0,"0",{"$f":"IF(L37=\"\",\"\",IF(D37=56300,COUNTIF(D$19:D37,D37),\"\"))","v":""},null,null,null,19,"スポーツ社会学演習（２）Ａ","東伏見","5001014020","01","春学期","月","４時限",2,"中澤　篤史","専門演習"]
[null,null,0,"0",0,"0",{"$f":"IF(L38=\"\",\"\",IF(D38=56300,COUNTIF(D$19:D38,D38),\"\"))","v":""},null,null,null,20,"スポーツビジネス・アドミニストレーション演習（２）Ａ","東伏見","5001014124","01","春学期","月","４時限",2,"武藤　泰明","専門演習"]
[null,null,0,"0",0,"0",{"$f":"IF(L39=\"\",\"\",IF(D39=56300,COUNTIF(D$19:D39,D39),\"\"))","v":""},null,null,null,21,"スポーツビジネス法演習（２）Ａ","東伏見","5001014128","01","春学期","月","４時限",2,"松本　泰介","専門演習"]
[null,null,0,"0",0,"0",{"$f":"IF(L40=\"\",\"\",IF(D40=56300,COUNTIF(D$19:D40,D40),\"\"))","v":""},null,null,null,22,"スポーツ神経精神医科学演習（１）Ａ","所沢","5001013210","01","春学期","月","４時限",2,"西多　昌規","専門演習"]
[null,null,0,"0",0,"0",{"$f":"IF(L41=\"\",\"\",IF(D41=56300,COUNTIF(D$19:D41,D41),\"\"))","v":""},null,null,null,23,"健康行動科学演習（２）Ａ","所沢","5001014232","01","春学期","月","４時限",2,"岡　浩一朗","専門演習"]
[null,null,0,"0",0,"0",{"$f":"IF(L42=\"\",\"\",IF(D42=56300,COUNTIF(D$19:D42,D42),\"\"))","v":""},null,null,null,24,"健康教育学演習（２）Ａ","所沢","5001014246","01","春学期","月","４時限",2,"石井　香織","専門演習"]
[null,null,0,"0",0,"0",{"$f":"IF(L43=\"\",\"\",IF(D43=56300,COUNTIF(D$19:D43,D43),\"\"))","v":""},null,null,null,25,"アスレティックパフォーマンス演習（２）Ａ","所沢","5001014250","01","春学期","月","４時限",2,"平山　邦明","専門演習"]
[null,null,0,"0",0,"0",{"$f":"IF(L44=\"\",\"\",IF(D44=56300,COUNTIF(D$19:D44,D44),\"\"))","v":""},null,null,null,26,"舞踊論演習（２）Ａ","所沢","5001014030","01","春学期","月","５時限",2,"杉山　千鶴","専門演習"]
[null,null,0,"0",0,"0",{"$f":"IF(L45=\"\",\"\",IF(D45=56300,COUNTIF(D$19:D45,D45),\"\"))","v":""},null,null,null,27,"スポーツ社会学特論","東伏見","5001015020","01","春学期","月","５時限",2,"中澤　篤史","専門講義"]
[null,null,0,"0",0,"0",{"$f":"IF(L46=\"\",\"\",IF(D46=56300,COUNTIF(D$19:D46,D46),\"\"))","v":""},null,null,null,28,"運動代謝学演習（１）Ａ","所沢","5001013242","01","春学期","月","５時限",2,"宮下　政司","専門演習"]
[null,null,0,"0",0,"0",{"$f":"IF(L47=\"\",\"\",IF(D47=56300,COUNTIF(D$19:D47,D47),\"\"))","v":""},null,null,null,29,"バイオメカニクス演習（１）Ａ","所沢","5001013342","01","春学期","月","５時限",2,"矢内　利政","専門演習"]
[null,null,0,"0",0,"0",{"$f":"IF(L48=\"\",\"\",IF(D48=56300,COUNTIF(D$19:D48,D48),\"\"))","v":""},null,null,null,30,"ボールゲーム戦術戦略論演習（２）Ａ","東伏見","5001014416","01","春学期","月","５時限",2,"倉石　平","専門演習"]
[null,null,0,"0",0,"0",{"$f":"IF(L49=\"\",\"\",IF(D49=56300,COUNTIF(D$19:D49,D49),\"\"))","v":""},null,null,null,31,"運動代謝学演習（２）Ａ","所沢","5001014242","01","春学期","月","６時限",2,"宮下　政司","専門演習"]
[null,null,0,"0",0,"0",{"$f":"IF(L50=\"\",\"\",IF(D50=56300,COUNTIF(D$19:D50,D50),\"\"))","v":""},null,null,null,32,"スポーツコーチング学演習（１）Ａ","所沢","5001013410","01","春学期","火","１時限",2,"土屋　純","専門演習"]
[null,null,0,"0",0,"0",{"$f":"IF(L51=\"\",\"\",IF(D51=56300,COUNTIF(D$19:D51,D51),\"\"))","v":""},null,null,null,33,"チームスポーツコーチング論演習（１）Ａ","所沢","5001013430","01","春学期","火","１時限",2,"松井　泰二","専門演習"]
[null,null,0,"0",0,"0",{"$f":"IF(L52=\"\",\"\",IF(D52=56300,COUNTIF(D$19:D52,D52),\"\"))","v":""},null,null,null,34,"健康教育学特論","所沢","5001015257","01","春学期","火","２時限",2,"石井　香織","専門講義"]
[null,null,0,{"$f":"IF(C53,56300,\"0\")","v":"0"},{"$f":"D53*S53","v":0},{"$f":"IF(AND(C53=-1,U53=\"専門演習\"),35000,\"0\")","v":"0"},{"$f":"IF(L53=\"\",\"\",IF(D53=56300,COUNTIF(D$19:D53,D53),\"\"))","v":""},null,null,null,35,"エリートコーチング演習（１）Ａ","所沢","5001013810","01","春学期          ","火","２時限        ",2,"土屋　純","専門演習"]
[null,null,0,"0",0,"0",{"$f":"IF(L54=\"\",\"\",IF(D54=56300,COUNTIF(D$19:D54,D54),\"\"))","v":""},null,null,null,36,"スポーツ神経科学演習（１）Ａ","所沢","5001013300","01","春学期","火","２時限",2,"彼末　一之","専門演習"]
[null,null,0,"0",0,"0",{"$f":"IF(L55=\"\",\"\",IF(D55=56300,COUNTIF(D$19:D55,D55),\"\"))","v":""},null,null,null,37,"スポーツ整形外科学演習（１）Ａ","所沢","5001013234","01","春学期","火","３時限",2,"金岡　恒治","専門演習"]
[null,null,0,"0",{"$f":"D56*S56","v":0},"0",{"$f":"IF(L56=\"\",\"\",IF(D56=56300,COUNTIF(D$19:D56,D56),\"\"))","v":""},null,null,null,38,"スポーツ内科学特論","所沢","5001015215","01","春学期","火","３時限",2,"坂本　静男","専門講義"]
[null,null,0,"0",0,"0",{"$f":"IF(L57=\"\",\"\",IF(D57=56300,COUNTIF(D$19:D57,D57),\"\"))","v":""},null,null,null,39,"スポーツ生理学演習（２）Ａ","所沢","5001014325","01","春学期","火","３時限",2,"村岡　功","専門演習"]
[null,null,0,"0",0,"0",{"$f":"IF(L58=\"\",\"\",IF(D58=56300,COUNTIF(D$19:D58,D58),\"\"))","v":""},null,null,null,40,"スポーツメディア論演習（２）Ａ","東伏見","5001014015","01","春学期","水","１時限",2,"トンプソン　リー　Ａ．","専門演習"]
[null,null,0,"0",0,"0",{"$f":"IF(L59=\"\",\"\",IF(D59=56300,COUNTIF(D$19:D59,D59),\"\"))","v":""},null,null,null,41,"体育科教育特論","所沢","5001015026","01","春学期","水","１時限",2,"吉永　武史","専門講義"]
[null,null,0,"0",0,"0",{"$f":"IF(L60=\"\",\"\",IF(D60=56300,COUNTIF(D$19:D60,D60),\"\"))","v":""},null,null,null,42,"ボールゲーム戦術戦略論演習（１）Ａ","東伏見","5001013416","01","春学期","水","１時限",2,"倉石　平","専門演習"]
{"$rows_left_out":249}
{"sheet":"stepＣ履修希望科目（様式②）","index":2,"n_rows":36,"n_cols":11,"rows_kept":36,"cut":false,"hidden":false,"merged":[[0,8,0,9],[1,2,1,8],[22,8,23,10],[25,8,26,10],[27,0,27,1],[27,2,27,10],[19,1,19,3],[19,4,19,6],[19,7,19,9],[22,5,23,5],[22,6,23,6],[22,7,23,7],[25,4,26,4],[25,5,26,5],[25,6,26,6],[25,7,26,7],[3,8,3,10],[4,8,4,10],[5,8,5,10],[21,8,21,10],[24,8,24,10],[0,0,0,1],[4,6,4,7],[5,6,5,7],[21,0,26,1],[11,0,19,0],[2,2,2,7],[21,2,21,3],[22,2,22,3],[24,2,24,3],[25,2,25,3],[26,2,26,3],[22,4,23,4],[23,2,23,3],[3,6,3,7]]}
["様式②　",null,null,null,null,null,null,null,"※受験番号"]
[null,null,"2020年度 大学院スポーツ科学研究科\n履修希望科目用紙",null,null,null,null,null,null,null,"※受験番号は無記入のこと"]
[]
[null,null,null,null,null,null,"出願区分\n（不要なものを削除→）",null,"一般科目等履修生　・　委託履修生"]
[null,"ﾌﾘｶﾞﾅ",{"$f":"T(時間割一覧!O4)","v":"ワセダ　タロウ"},null,null,null,"携帯電話",null,{"$f":"T(時間割一覧!U3)","v":"090-9999-9999"}]
[null,"氏名",{"$f":"T(時間割一覧!O3)","v":"早稲田　太郎"},null,null,null,"自宅電話",null,{"$f":"T(時間割一覧!U4)","v":"03-9999-9999"}]
[]
[]
[null,"聴講科目"]
[null,"＜以下整理番号と科目名は「聴講理由書」と連動させること＞",null,null,null,null,null,null,"※履修上限単位数：年間8単位まで"]
[null,"整理\n番号","科目名","科目\nクラス\nコード","キャンパス","実施科目キー","学期","曜日","時限","単位数","担当教員"]
["聴講科目",{"$f":"IF(ROW(A1)>MAX(時間割一覧!$G:$G),\"\",INDEX(時間割一覧!$K:$T,MATCH(ROW(A1),時間割一覧!$G:$G,0),COLUMN(A1)))","v":""},{"$f":"IF(ROW(B1)>MAX(時間割一覧!$G:$G),\"\",INDEX(時間割一覧!$K:$T,MATCH(ROW(B1),時間割一覧!$G:$G,0),COLUMN(B1)))","v":""},{"$f":"IF(ROW(E1)>MAX(時間割一覧!$G:$G),\"\",INDEX(時間割一覧!$K:$T,MATCH(ROW(E1),時間割一覧!$G:$G,0),COLUMN(E1)))","v":""},{"$f":"IF(ROW(C1)>MAX(時間割一覧!$G:$G),\"\",INDEX(時間割一覧!$K:$T,MATCH(ROW(C1),時間割一覧!$G:$G,0),COLUMN(C1)))","v":""},{"$f":"IF(ROW(D1)>MAX(時間割一覧!$G:$G),\"\",INDEX(時間割一覧!$K:$T,MATCH(ROW(D1),時間割一覧!$G:$G,0),COLUMN(D1)))","v":""},{"$f":"IF(ROW(F1)>MAX(時間割一覧!$G:$G),\"\",INDEX(時間割一覧!$K:$T,MATCH(ROW(F1),時間割一覧!$G:$G,0),COLUMN(F1)))","v":""},{"$f":"IF(ROW(G1)>MAX(時間割一覧!$G:$G),\"\",INDEX(時間割一覧!$K:$T,MATCH(ROW(G1),時間割一覧!$G:$G,0),COLUMN(G1)))","v":""},{"$f":"IF(ROW(H1)>MAX(時間割一覧!$G:$G),\"\",INDEX(時間割一覧!$K:$T,MATCH(ROW(H1),時間割一覧!$G:$G,0),COLUMN(H1)))","v":""},{"$f":"IF(ROW(I1)>MAX(時間割一覧!$G:$G),\"\",INDEX(時間割一覧!$K:$T,MATCH(ROW(I1),時間割一覧!$G:$G,0),COLUMN(I1)))","v":""},{"$f":"IF(ROW(J1)>MAX(時間割一覧!$G:$G),\"\",INDEX(時間割一覧!$K:$T,MATCH(ROW(J1),時間割一覧!$G:$G,0),COLUMN(J1)))","v":""}]
[null,{"$f":"IF(ROW(A2)>MAX(時間割一覧!$G:$G),\"\",INDEX(時間割一覧!$K:$T,MATCH(ROW(A2),時間割一覧!$G:$G,0),COLUMN(A2)))","v":""},{"$f":"IF(ROW(B2)>MAX(時間割一覧!$G:$G),\"\",INDEX(時間割一覧!$K:$T,MATCH(ROW(B2),時間割一覧!$G:$G,0),COLUMN(B2)))","v":""},{"$f":"IF(ROW(E2)>MAX(時間割一覧!$G:$G),\"\",INDEX(時間割一覧!$K:$T,MATCH(ROW(E2),時間割一覧!$G:$G,0),COLUMN(E2)))","v":""},{"$f":"IF(ROW(C2)>MAX(時間割一覧!$G:$G),\"\",INDEX(時間割一覧!$K:$T,MATCH(ROW(C2),時間割一覧!$G:$G,0),COLUMN(C2)))","v":""},{"$f":"IF(ROW(D2)>MAX(時間割一覧!$G:$G),\"\",INDEX(時間割一覧!$K:$T,MATCH(ROW(D2),時間割一覧!$G:$G,0),COLUMN(D2)))","v":""},{"$f":"IF(ROW(F2)>MAX(時間割一覧!$G:$G),\"\",INDEX(時間割一覧!$K:$T,MATCH(ROW(F2),時間割一覧!$G:$G,0),COLUMN(F2)))","v":""},{"$f":"IF(ROW(G2)>MAX(時間割一覧!$G:$G),\"\",INDEX(時間割一覧!$K:$T,MATCH(ROW(G2),時間割一覧!$G:$G,0),COLUMN(G2)))","v":""},{"$f":"IF(ROW(H2)>MAX(時間割一覧!$G:$G),\"\",INDEX(時間割一覧!$K:$T,MATCH(ROW(H2),時間割一覧!$G:$G,0),COLUMN(H2)))","v":""},{"$f":"IF(ROW(I2)>MAX(時間割一覧!$G:$G),\"\",INDEX(時間割一覧!$K:$T,MATCH(ROW(I2),時間割一覧!$G:$G,0),COLUMN(I2)))","v":""},{"$f":"IF(ROW(J2)>MAX(時間割一覧!$G:$G),\"\",INDEX(時間割一覧!$K:$T,MATCH(ROW(J2),時間割一覧!$G:$G,0),COLUMN(J2)))","v":""}]
[null,{"$f":"IF(ROW(A3)>MAX(時間割一覧!$G:$G),\"\",INDEX(時間割一覧!$K:$T,MATCH(ROW(A3),時間割一覧!$G:$G,0),COLUMN(A3)))","v":""},{"$f":"IF(ROW(B3)>MAX(時間割一覧!$G:$G),\"\",INDEX(時間割一覧!$K:$T,MATCH(ROW(B3),時間割一覧!$G:$G,0),COLUMN(B3)))","v":""},{"$f":"IF(ROW(E3)>MAX(時間割一覧!$G:$G),\"\",INDEX(時間割一覧!$K:$T,MATCH(ROW(E3),時間割一覧!$G:$G,0),COLUMN(E3)))","v":""},{"$f":"IF(ROW(C3)>MAX(時間割一覧!$G:$G),\"\",INDEX(時間割一覧!$K:$T,MATCH(ROW(C3),時間割一覧!$G:$G,0),COLUMN(C3)))","v":""},{"$f":"IF(ROW(D3)>MAX(時間割一覧!$G:$G),\"\",INDEX(時間割一覧!$K:$T,MATCH(ROW(D3),時間割一覧!$G:$G,0),COLUMN(D3)))","v":""},{"$f":"IF(ROW(F3)>MAX(時間割一覧!$G:$G),\"\",INDEX(時間割一覧!$K:$T,MATCH(ROW(F3),時間割一覧!$G:$G,0),COLUMN(F3)))","v":""},{"$f":"IF(ROW(G3)>MAX(時間割一覧!$G:$G),\"\",INDEX(時間割一覧!$K:$T,MATCH(ROW(G3),時間割一覧!$G:$G,0),COLUMN(G3)))","v":""},{"$f":"IF(ROW(H3)>MAX(時間割一覧!$G:$G),\"\",INDEX(時間割一覧!$K:$T,MATCH(ROW(H3),時間割一覧!$G:$G,0),COLUMN(H3)))","v":""},{"$f":"IF(ROW(I3)>MAX(時間割一覧!$G:$G),\"\",INDEX(時間割一覧!$K:$T,MATCH(ROW(I3),時間割一覧!$G:$G,0),COLUMN(I3)))","v":""},{"$f":"IF(ROW(J3)>MAX(時間割一覧!$G:$G),\"\",INDEX(時間割一覧!$K:$T,MATCH(ROW(J3),時間割一覧!$G:$G,0),COLUMN(J3)))","v":""}]
[null,{"$f":"IF(ROW(A4)>MAX(時間割一覧!$G:$G),\"\",INDEX(時間割一覧!$K:$T,MATCH(ROW(A4),時間割一覧!$G:$G,0),COLUMN(A4)))","v":""},{"$f":"IF(ROW(B4)>MAX(時間割一覧!$G:$G),\"\",INDEX(時間割一覧!$K:$T,MATCH(ROW(B4),時間割一覧!$G:$G,0),COLUMN(B4)))","v":""},{"$f":"IF(ROW(E4)>MAX(時間割一覧!$G:$G),\"\",INDEX(時間割一覧!$K:$T,MATCH(ROW(E4),時間割一覧!$G:$G,0),COLUMN(E4)))","v":""},{"$f":"IF(ROW(C4)>MAX(時間割一覧!$G:$G),\"\",INDEX(時間割一覧!$K:$T,MATCH(ROW(C4),時間割一覧!$G:$G,0),COLUMN(C4)))","v":""},{"$f":"IF(ROW(D4)>MAX(時間割一覧!$G:$G),\"\",INDEX(時間割一覧!$K:$T,MATCH(ROW(D4),時間割一覧!$G:$G,0),COLUMN(D4)))","v":""},{"$f":"IF(ROW(F4)>MAX(時間割一覧!$G:$G),\"\",INDEX(時間割一覧!$K:$T,MATCH(ROW(F4),時間割一覧!$G:$G,0),COLUMN(F4)))","v":""},{"$f":"IF(ROW(G4)>MAX(時間割一覧!$G:$G),\"\",INDEX(時間割一覧!$K:$T,MATCH(ROW(G4),時間割一覧!$G:$G,0),COLUMN(G4)))","v":""},{"$f":"IF(ROW(H4)>MAX(時間割一覧!$G:$G),\"\",INDEX(時間割一覧!$K:$T,MATCH(ROW(H4),時間割一覧!$G:$G,0),COLUMN(H4)))","v":""},{"$f":"IF(ROW(I4)>MAX(時間割一覧!$G:$G),\"\",INDEX(時間割一覧!$K:$T,MATCH(ROW(I4),時間割一覧!$G:$G,0),COLUMN(I4)))","v":""},{"$f":"IF(ROW(J4)>MAX(時間割一覧!$G:$G),\"\",INDEX(時間割一覧!$K:$T,MATCH(ROW(J4),時間割一覧!$G:$G,0),COLUMN(J4)))","v":""}]
[null,{"$f":"IF(ROW(A5)>MAX(時間割一覧!$G:$G),\"\",INDEX(時間割一覧!$K:$T,MATCH(ROW(A5),時間割一覧!$G:$G,0),COLUMN(A5)))","v":""},{"$f":"IF(ROW(B5)>MAX(時間割一覧!$G:$G),\"\",INDEX(時間割一覧!$K:$T,MATCH(ROW(B5),時間割一覧!$G:$G,0),COLUMN(B5)))","v":""},{"$f":"IF(ROW(E5)>MAX(時間割一覧!$G:$G),\"\",INDEX(時間割一覧!$K:$T,MATCH(ROW(E5),時間割一覧!$G:$G,0),COLUMN(E5)))","v":""},{"$f":"IF(ROW(C5)>MAX(時間割一覧!$G:$G),\"\",INDEX(時間割一覧!$K:$T,MATCH(ROW(C5),時間割一覧!$G:$G,0),COLUMN(C5)))","v":""},{"$f":"IF(ROW(D5)>MAX(時間割一覧!$G:$G),\"\",INDEX(時間割一覧!$K:$T,MATCH(ROW(D5),時間割一覧!$G:$G,0),COLUMN(D5)))","v":""},{"$f":"IF(ROW(F5)>MAX(時間割一覧!$G:$G),\"\",INDEX(時間割一覧!$K:$T,MATCH(ROW(F5),時間割一覧!$G:$G,0),COLUMN(F5)))","v":""},{"$f":"IF(ROW(G5)>MAX(時間割一覧!$G:$G),\"\",INDEX(時間割一覧!$K:$T,MATCH(ROW(G5),時間割一覧!$G:$G,0),COLUMN(G5)))","v":""},{"$f":"IF(ROW(H5)>MAX(時間割一覧!$G:$G),\"\",INDEX(時間割一覧!$K:$T,MATCH(ROW(H5),時間割一覧!$G:$G,0),COLUMN(H5)))","v":""},{"$f":"IF(ROW(I5)>MAX(時間割一覧!$G:$G),\"\",INDEX(時間割一覧!$K:$T,MATCH(ROW(I5),時間割一覧!$G:$G,0),COLUMN(I5)))","v":""},{"$f":"IF(ROW(J5)>MAX(時間割一覧!$G:$G),\"\",INDEX(時間割一覧!$K:$T,MATCH(ROW(J5),時間割一覧!$G:$G,0),COLUMN(J5)))","v":""}]
[null,{"$f":"IF(ROW(A6)>MAX(時間割一覧!$G:$G),\"\",INDEX(時間割一覧!$K:$T,MATCH(ROW(A6),時間割一覧!$G:$G,0),COLUMN(A6)))","v":""},{"$f":"IF(ROW(B6)>MAX(時間割一覧!$G:$G),\"\",INDEX(時間割一覧!$K:$T,MATCH(ROW(B6),時間割一覧!$G:$G,0),COLUMN(B6)))","v":""},{"$f":"IF(ROW(E6)>MAX(時間割一覧!$G:$G),\"\",INDEX(時間割一覧!$K:$T,MATCH(ROW(E6),時間割一覧!$G:$G,0),COLUMN(E6)))","v":""},{"$f":"IF(ROW(C6)>MAX(時間割一覧!$G:$G),\"\",INDEX(時間割一覧!$K:$T,MATCH(ROW(C6),時間割一覧!$G:$G,0),COLUMN(C6)))","v":""},{"$f":"IF(ROW(D6)>MAX(時間割一覧!$G:$G),\"\",INDEX(時間割一覧!$K:$T,MATCH(ROW(D6),時間割一覧!$G:$G,0),COLUMN(D6)))","v":""},{"$f":"IF(ROW(F6)>MAX(時間割一覧!$G:$G),\"\",INDEX(時間割一覧!$K:$T,MATCH(ROW(F6),時間割一覧!$G:$G,0),COLUMN(F6)))","v":""},{"$f":"IF(ROW(G6)>MAX(時間割一覧!$G:$G),\"\",INDEX(時間割一覧!$K:$T,MATCH(ROW(G6),時間割一覧!$G:$G,0),COLUMN(G6)))","v":""},{"$f":"IF(ROW(H6)>MAX(時間割一覧!$G:$G),\"\",INDEX(時間割一覧!$K:$T,MATCH(ROW(H6),時間割一覧!$G:$G,0),COLUMN(H6)))","v":""},{"$f":"IF(ROW(I6)>MAX(時間割一覧!$G:$G),\"\",INDEX(時間割一覧!$K:$T,MATCH(ROW(I6),時間割一覧!$G:$G,0),COLUMN(I6)))","v":""},{"$f":"IF(ROW(J6)>MAX(時間割一覧!$G:$G),\"\",INDEX(時間割一覧!$K:$T,MATCH(ROW(J6),時間割一覧!$G:$G,0),COLUMN(J6)))","v":""}]
[null,{"$f":"IF(ROW(A7)>MAX(時間割一覧!$G:$G),\"\",INDEX(時間割一覧!$K:$T,MATCH(ROW(A7),時間割一覧!$G:$G,0),COLUMN(A7)))","v":""},{"$f":"IF(ROW(B7)>MAX(時間割一覧!$G:$G),\"\",INDEX(時間割一覧!$K:$T,MATCH(ROW(B7),時間割一覧!$G:$G,0),COLUMN(B7)))","v":""},{"$f":"IF(ROW(E7)>MAX(時間割一覧!$G:$G),\"\",INDEX(時間割一覧!$K:$T,MATCH(ROW(E7),時間割一覧!$G:$G,0),COLUMN(E7)))","v":""},{"$f":"IF(ROW(C7)>MAX(時間割一覧!$G:$G),\"\",INDEX(時間割一覧!$K:$T,MATCH(ROW(C7),時間割一覧!$G:$G,0),COLUMN(C7)))","v":""},{"$f":"IF(ROW(D7)>MAX(時間割一覧!$G:$G),\"\",INDEX(時間割一覧!$K:$T,MATCH(ROW(D7),時間割一覧!$G:$G,0),COLUMN(D7)))","v":""},{"$f":"IF(ROW(F7)>MAX(時間割一覧!$G:$G),\"\",INDEX(時間割一覧!$K:$T,MATCH(ROW(F7),時間割一覧!$G:$G,0),COLUMN(F7)))","v":""},{"$f":"IF(ROW(G7)>MAX(時間割一覧!$G:$G),\"\",INDEX(時間割一覧!$K:$T,MATCH(ROW(G7),時間割一覧!$G:$G,0),COLUMN(G7)))","v":""},{"$f":"IF(ROW(H7)>MAX(時間割一覧!$G:$G),\"\",INDEX(時間割一覧!$K:$T,MATCH(ROW(H7),時間割一覧!$G:$G,0),COLUMN(H7)))","v":""},{"$f":"IF(ROW(I7)>MAX(時間割一覧!$G:$G),\"\",INDEX(時間割一覧!$K:$T,MATCH(ROW(I7),時間割一覧!$G:$G,0),COLUMN(I7)))","v":""},{"$f":"IF(ROW(J7)>MAX(時間割一覧!$G:$G),\"\",INDEX(時間割一覧!$K:$T,MATCH(ROW(J7),時間割一覧!$G:$G,0),COLUMN(J7)))","v":""}]
[null,{"$f":"IF(ROW(A8)>MAX(時間割一覧!$G:$G),\"\",INDEX(時間割一覧!$K:$T,MATCH(ROW(A8),時間割一覧!$G:$G,0),COLUMN(A8)))","v":""},{"$f":"IF(ROW(B8)>MAX(時間割一覧!$G:$G),\"\",INDEX(時間割一覧!$K:$T,MATCH(ROW(B8),時間割一覧!$G:$G,0),COLUMN(B8)))","v":""},{"$f":"IF(ROW(E8)>MAX(時間割一覧!$G:$G),\"\",INDEX(時間割一覧!$K:$T,MATCH(ROW(E8),時間割一覧!$G:$G,0),COLUMN(E8)))","v":""},{"$f":"IF(ROW(C8)>MAX(時間割一覧!$G:$G),\"\",INDEX(時間割一覧!$K:$T,MATCH(ROW(C8),時間割一覧!$G:$G,0),COLUMN(C8)))","v":""},{"$f":"IF(ROW(D8)>MAX(時間割一覧!$G:$G),\"\",INDEX(時間割一覧!$K:$T,MATCH(ROW(D8),時間割一覧!$G:$G,0),COLUMN(D8)))","v":""},{"$f":"IF(ROW(F8)>MAX(時間割一覧!$G:$G),\"\",INDEX(時間割一覧!$K:$T,MATCH(ROW(F8),時間割一覧!$G:$G,0),COLUMN(F8)))","v":""},{"$f":"IF(ROW(G8)>MAX(時間割一覧!$G:$G),\"\",INDEX(時間割一覧!$K:$T,MATCH(ROW(G8),時間割一覧!$G:$G,0),COLUMN(G8)))","v":""},{"$f":"IF(ROW(H8)>MAX(時間割一覧!$G:$G),\"\",INDEX(時間割一覧!$K:$T,MATCH(ROW(H8),時間割一覧!$G:$G,0),COLUMN(H8)))","v":""},{"$f":"IF(ROW(I8)>MAX(時間割一覧!$G:$G),\"\",INDEX(時間割一覧!$K:$T,MATCH(ROW(I8),時間割一覧!$G:$G,0),COLUMN(I8)))","v":""},{"$f":"IF(ROW(J8)>MAX(時間割一覧!$G:$G),\"\",INDEX(時間割一覧!$K:$T,MATCH(ROW(J8),時間割一覧!$G:$G,0),COLUMN(J8)))","v":""}]
[null,"合計",null,null,{"$f":"SUM(時間割一覧!V7:V12)","v":0},null,null,{"$f":"SUM(J12:J19)","v":0}]
[]
["研究指導\n（委託履修生のみ)",null,"研究指導名称",null,"学期","曜日","時限","単位","指導教員名"]
[]
[null,null,"研究指導"]
[null,null,"研究指導名称",null,"学期","曜日","時限","単位","指導教員名"]
[]
[null,null,"研究指導"]
["備考欄"]
[null,null,"※聴講科目の合計単位数の上限は8単位まで。"]
[null,null,"※研究指導は「委託履修生」で研究指導教員が許可した場合のみ。"]
[]
["＜チェック欄＞※必ず記載した内容をチェック☑した上で、ご提出ください"]
[null,"時間割の重複がないか確認した"]
[null,"遠距離エラーにならないことを確認した"]
[null,"（外国籍の方、かつ、日本語科目の登録を希望する場合）日本語教育研究センターの出願・科目登録手続き方法について確認した"]
[null,"（外国籍の方のみ）日本語教育研究センターの科目を含め在留資格に必要な時間数を満たしていることを確認した"]